{"text_format":"1","workbook":"xlsx","n_sheets":2,"sheets":["TEMPLATE Toppers","FACTSHEET Toppers"],"not_rendered":{"charts":0,"images":10,"macros":1,"external_links":0,"defined_names":3,"comments":0,"pivot_tables":0},"unopened":[],"bounds":{"document_bytes":16777216,"sheet_cells":100000,"rows_first":2000,"rows_last":500,"rows_between":2000,"halvings":0,"cell_chars":16384,"cell_head_chars":4096},"cells_cut":0,"cells_raw":0,"read":"whole","date_system":"1900"}

{"sheet":"TEMPLATE Toppers","index":0,"n_rows":355,"n_cols":41,"rows_kept":355,"cut":false,"hidden":false,"merged":[[1,1,1,25]]}
[]
[null,"Toppers Template"]
[null,"Uiting\nprint/online, online","Bijzonderheden \nnieuw, kijk online, op=op","Titel \nmax 50 karakters -\n merk + artikelnaam","Tekst / USP's \nmax 300 karakters - voordelen en toepassingen\n(zie Factsheet voor aanleverspecificaties)","Type\nBij meerdere artikelen in één actie. Vul het onderscheid tussen de artikelen in, niet zijnde de factuuromschrijving","Art. nr. TU",null,null,"Selecteer gewenste formaat:\n1/4 pagina\n1/2 pagina\n1/1 pagina (in overleg met TU)\n",null,null,null,null,null,null,null,null,null,null,null,null,null,null,null,"Actie \ninkoopprijs"]
[null,null,null,null,null,null,null,null,null,null,null,null,null,null,{"$f":"IF(OR(L4>0,#REF!>0)=TRUE,IF(AND(Q4=\"JA\",#REF!>0)=TRUE,(L4*(1-M4+N4))-S4,IF(#REF!>0,#REF!*(1-#REF!+K4),L4*(1-M4+N4))),\"\")","v":{"$error":"#REF!"}},{"$f":"IF(I4>0,(I4-O4)/I4,\"\")","v":""},null,{"$f":"IF(AND(Q4=\"JA\",#REF!>0)=TRUE,IF(#REF!=\"JA\",0,L4-#REF!),\"\" )","v":{"$error":"#REF!"}},{"$f":"IF(AND(Q4=\"JA\",#REF!>0)=TRUE,IF(#REF!=\"JA\",(L4-#REF!)+(L4*(N4-K4)),R4+(L4*(N4-K4))),\"\" )","v":{"$error":"#REF!"}},null,{"$f":"IF(F4>0,LEN(F4),\" \")","v":" "},{"$f":"IF(G4>0,LEN(G4),\" \")","v":" "},null,{"$f":"IF(H4>0,LEN(H4),\" \")","v":" "},{"$f":"IF(I4>0,LEN(I4),\" \")","v":" "}]
[null,"print","nieuw","Merk product","Zie factscheet aanleverspecificaties.","TU-123A",4907317,null,null,"1/4 pagina",null,null,null,null,{"$f":"IF(OR(L5>0,#REF!>0)=TRUE,IF(AND(Q5=\"JA\",#REF!>0)=TRUE,(L5*(1-M5+N5))-S5,IF(#REF!>0,#REF!*(1-#REF!+K5),L5*(1-M5+N5))),\"\")","v":{"$error":"#REF!"}}]
[null,null,null,null,null,null,null,{"$f":"R6","v":{"$error":"#REF!"}},null,null,null,null,null,null,null,null,null,{"$f":"VLOOKUP(G6,#REF!,3,FALSE)","v":{"$error":"#REF!"}},{"$f":"VLOOKUP(G6,#REF!,6,FALSE)","v":{"$error":"#REF!"}},{"$f":"VLOOKUP(G6,#REF!,4,FALSE)","v":{"$error":"#REF!"}}]
[null,null,null,null,null,null,null,{"$error":"#REF!"},null,null,null,null,null,null,null,null,null,{"$f":"VLOOKUP(G7,#REF!,3,FALSE)","v":{"$error":"#REF!"}},{"$f":"VLOOKUP(G7,#REF!,6,FALSE)","v":{"$error":"#REF!"}},{"$f":"VLOOKUP(G7,#REF!,4,FALSE)","v":{"$error":"#REF!"}}]
[null,null,null,null,null,null,null,{"$error":"#REF!"},null,null,null,null,null,null,null,null,null,{"$f":"VLOOKUP(G8,#REF!,3,FALSE)","v":{"$error":"#REF!"}},{"$f":"VLOOKUP(G8,#REF!,6,FALSE)","v":{"$error":"#REF!"}},{"$f":"VLOOKUP(G8,#REF!,4,FALSE)","v":{"$error":"#REF!"}}]
[null,null,null,null,null,null,null,{"$error":"#REF!"},null,null,null,null,null,null,null,null,null,{"$f":"VLOOKUP(G9,#REF!,3,FALSE)","v":{"$error":"#REF!"}},{"$f":"VLOOKUP(G9,#REF!,6,FALSE)","v":{"$error":"#REF!"}},{"$f":"VLOOKUP(G9,#REF!,4,FALSE)","v":{"$error":"#REF!"}}]
[null,null,null,null,null,null,null,{"$error":"#REF!"},null,null,null,null,null,null,null,null,null,{"$f":"VLOOKUP(G10,#REF!,3,FALSE)","v":{"$error":"#REF!"}},{"$f":"VLOOKUP(G10,#REF!,6,FALSE)","v":{"$error":"#REF!"}},{"$f":"VLOOKUP(G10,#REF!,4,FALSE)","v":{"$error":"#REF!"}}]
[null,null,null,null,null,null,null,{"$error":"#REF!"},null,null,null,null,null,null,null,null,null,{"$f":"VLOOKUP(G11,#REF!,3,FALSE)","v":{"$error":"#REF!"}},{"$f":"VLOOKUP(G11,#REF!,6,FALSE)","v":{"$error":"#REF!"}},{"$f":"VLOOKUP(G11,#REF!,4,FALSE)","v":{"$error":"#REF!"}}]
[null,null,null,null,null,null,null,{"$error":"#REF!"},null,null,null,null,null,null,null,null,null,{"$f":"VLOOKUP(G12,#REF!,3,FALSE)","v":{"$error":"#REF!"}},{"$f":"VLOOKUP(G12,#REF!,6,FALSE)","v":{"$error":"#REF!"}},{"$f":"VLOOKUP(G12,#REF!,4,FALSE)","v":{"$error":"#REF!"}}]
[null,null,null,null,null,null,null,{"$error":"#REF!"},null,null,null,null,null,null,null,null,null,{"$f":"VLOOKUP(G13,#REF!,3,FALSE)","v":{"$error":"#REF!"}},{"$f":"VLOOKUP(G13,#REF!,6,FALSE)","v":{"$error":"#REF!"}},{"$f":"VLOOKUP(G13,#REF!,4,FALSE)","v":{"$error":"#REF!"}}]
[null,null,null,null,null,null,null,{"$error":"#REF!"},null,null,null,null,null,null,null,null,null,{"$f":"VLOOKUP(G14,#REF!,3,FALSE)","v":{"$error":"#REF!"}},{"$f":"VLOOKUP(G14,#REF!,6,FALSE)","v":{"$error":"#REF!"}},{"$f":"VLOOKUP(G14,#REF!,4,FALSE)","v":{"$error":"#REF!"}}]
[null,null,null,null,null,null,null,{"$f":"R15","v":{"$error":"#REF!"}},null,null,null,null,null,null,null,null,null,{"$f":"VLOOKUP(G15,#REF!,3,FALSE)","v":{"$error":"#REF!"}},{"$f":"VLOOKUP(G15,#REF!,6,FALSE)","v":{"$error":"#REF!"}},{"$f":"VLOOKUP(G15,#REF!,4,FALSE)","v":{"$error":"#REF!"}}]
[null,null,null,null,null,null,null,{"$error":"#REF!"},null,null,null,null,null,null,null,null,null,{"$f":"VLOOKUP(G16,#REF!,3,FALSE)","v":{"$error":"#REF!"}},{"$f":"VLOOKUP(G16,#REF!,6,FALSE)","v":{"$error":"#REF!"}},{"$f":"VLOOKUP(G16,#REF!,4,FALSE)","v":{"$error":"#REF!"}}]
[null,null,null,null,null,null,null,{"$error":"#REF!"},null,null,null,null,null,null,null,null,null,{"$f":"VLOOKUP(G17,#REF!,3,FALSE)","v":{"$error":"#REF!"}},{"$f":"VLOOKUP(G17,#REF!,6,FALSE)","v":{"$error":"#REF!"}},{"$f":"VLOOKUP(G17,#REF!,4,FALSE)","v":{"$error":"#REF!"}}]
[null,null,null,null,null,null,null,{"$error":"#REF!"},null,null,null,null,null,null,null,null,null,{"$f":"VLOOKUP(G18,#REF!,3,FALSE)","v":{"$error":"#REF!"}},{"$f":"VLOOKUP(G18,#REF!,6,FALSE)","v":{"$error":"#REF!"}},{"$f":"VLOOKUP(G18,#REF!,4,FALSE)","v":{"$error":"#REF!"}}]
[null,null,null,null,null,null,null,{"$error":"#REF!"},null,null,null,null,null,null,null,null,null,{"$f":"VLOOKUP(G19,#REF!,3,FALSE)","v":{"$error":"#REF!"}},{"$f":"VLOOKUP(G19,#REF!,6,FALSE)","v":{"$error":"#REF!"}},{"$f":"VLOOKUP(G19,#REF!,4,FALSE)","v":{"$error":"#REF!"}}]
[null,null,null,null,null,null,null,{"$error":"#REF!"},null,null,null,null,null,null,null,null,null,{"$f":"VLOOKUP(G20,#REF!,3,FALSE)","v":{"$error":"#REF!"}},{"$f":"VLOOKUP(G20,#REF!,6,FALSE)","v":{"$error":"#REF!"}},{"$f":"VLOOKUP(G20,#REF!,4,FALSE)","v":{"$error":"#REF!"}}]
[null,null,null,null,null,null,null,{"$error":"#REF!"},null,null,null,null,null,null,null,null,null,{"$f":"VLOOKUP(G21,#REF!,3,FALSE)","v":{"$error":"#REF!"}},{"$f":"VLOOKUP(G21,#REF!,6,FALSE)","v":{"$error":"#REF!"}},{"$f":"VLOOKUP(G21,#REF!,4,FALSE)","v":{"$error":"#REF!"}}]
[null,null,null,null,null,null,null,{"$error":"#REF!"},null,null,null,null,null,null,null,null,null,{"$f":"VLOOKUP(G22,#REF!,3,FALSE)","v":{"$error":"#REF!"}},{"$f":"VLOOKUP(G22,#REF!,6,FALSE)","v":{"$error":"#REF!"}},{"$f":"VLOOKUP(G22,#REF!,4,FALSE)","v":{"$error":"#REF!"}}]
[null,null,null,null,null,null,null,{"$error":"#REF!"},null,null,null,null,null,null,null,null,null,{"$f":"VLOOKUP(G23,#REF!,3,FALSE)","v":{"$error":"#REF!"}},{"$f":"VLOOKUP(G23,#REF!,6,FALSE)","v":{"$error":"#REF!"}},{"$f":"VLOOKUP(G23,#REF!,4,FALSE)","v":{"$error":"#REF!"}}]
[null,null,null,null,null,null,null,{"$error":"#REF!"},null,null,null,null,null,null,null,null,null,{"$f":"VLOOKUP(G24,#REF!,3,FALSE)","v":{"$error":"#REF!"}},{"$f":"VLOOKUP(G24,#REF!,6,FALSE)","v":{"$error":"#REF!"}},{"$f":"VLOOKUP(G24,#REF!,4,FALSE)","v":{"$error":"#REF!"}}]
[null,null,null,null,null,null,null,{"$error":"#REF!"},null,null,null,null,null,null,null,null,null,{"$f":"VLOOKUP(G25,#REF!,3,FALSE)","v":{"$error":"#REF!"}},{"$f":"VLOOKUP(G25,#REF!,6,FALSE)","v":{"$error":"#REF!"}},{"$f":"VLOOKUP(G25,#REF!,4,FALSE)","v":{"$error":"#REF!"}}]
[null,null,null,null,null,null,null,{"$error":"#REF!"},null,null,null,null,null,null,null,null,null,{"$f":"VLOOKUP(G26,#REF!,3,FALSE)","v":{"$error":"#REF!"}},{"$f":"VLOOKUP(G26,#REF!,6,FALSE)","v":{"$error":"#REF!"}},{"$f":"VLOOKUP(G26,#REF!,4,FALSE)","v":{"$error":"#REF!"}}]
[null,null,null,null,null,null,null,{"$error":"#REF!"},null,null,null,null,null,null,null,null,null,{"$f":"VLOOKUP(G27,#REF!,3,FALSE)","v":{"$error":"#REF!"}},{"$f":"VLOOKUP(G27,#REF!,6,FALSE)","v":{"$error":"#REF!"}},{"$f":"VLOOKUP(G27,#REF!,4,FALSE)","v":{"$error":"#REF!"}}]
[null,null,null,null,null,null,null,{"$error":"#REF!"},null,null,null,null,null,null,null,null,null,{"$f":"VLOOKUP(G28,#REF!,3,FALSE)","v":{"$error":"#REF!"}},{"$f":"VLOOKUP(G28,#REF!,6,FALSE)","v":{"$error":"#REF!"}},{"$f":"VLOOKUP(G28,#REF!,4,FALSE)","v":{"$error":"#REF!"}}]
[null,null,null,null,null,null,null,{"$error":"#REF!"},null,null,null,null,null,null,null,null,null,{"$f":"VLOOKUP(G29,#REF!,3,FALSE)","v":{"$error":"#REF!"}},{"$f":"VLOOKUP(G29,#REF!,6,FALSE)","v":{"$error":"#REF!"}},{"$f":"VLOOKUP(G29,#REF!,4,FALSE)","v":{"$error":"#REF!"}}]
[null,null,null,null,null,null,null,{"$error":"#REF!"},null,null,null,null,null,null,null,null,null,{"$f":"VLOOKUP(G30,#REF!,3,FALSE)","v":{"$error":"#REF!"}},{"$f":"VLOOKUP(G30,#REF!,6,FALSE)","v":{"$error":"#REF!"}},{"$f":"VLOOKUP(G30,#REF!,4,FALSE)","v":{"$error":"#REF!"}}]
[null,null,null,null,null,null,null,{"$error":"#REF!"},null,null,null,null,null,null,null,null,null,{"$f":"VLOOKUP(G31,#REF!,3,FALSE)","v":{"$error":"#REF!"}},{"$f":"VLOOKUP(G31,#REF!,6,FALSE)","v":{"$error":"#REF!"}},{"$f":"VLOOKUP(G31,#REF!,4,FALSE)","v":{"$error":"#REF!"}}]
[null,null,null,null,null,null,null,{"$error":"#REF!"},null,null,null,null,null,null,null,null,null,{"$f":"VLOOKUP(G32,#REF!,3,FALSE)","v":{"$error":"#REF!"}},{"$f":"VLOOKUP(G32,#REF!,6,FALSE)","v":{"$error":"#REF!"}},{"$f":"VLOOKUP(G32,#REF!,4,FALSE)","v":{"$error":"#REF!"}}]
[null,null,null,null,null,null,null,{"$error":"#REF!"},null,null,null,null,null,null,null,null,null,{"$f":"VLOOKUP(G33,#REF!,3,FALSE)","v":{"$error":"#REF!"}},{"$f":"VLOOKUP(G33,#REF!,6,FALSE)","v":{"$error":"#REF!"}},{"$f":"VLOOKUP(G33,#REF!,4,FALSE)","v":{"$error":"#REF!"}}]
[null,null,null,null,null,null,null,{"$error":"#REF!"},null,null,null,null,null,null,null,null,null,{"$f":"VLOOKUP(G34,#REF!,3,FALSE)","v":{"$error":"#REF!"}},{"$f":"VLOOKUP(G34,#REF!,6,FALSE)","v":{"$error":"#REF!"}},{"$f":"VLOOKUP(G34,#REF!,4,FALSE)","v":{"$error":"#REF!"}}]
[null,null,null,null,null,null,null,{"$error":"#REF!"},null,null,null,null,null,null,null,null,null,{"$f":"VLOOKUP(G35,#REF!,3,FALSE)","v":{"$error":"#REF!"}},{"$f":"VLOOKUP(G35,#REF!,6,FALSE)","v":{"$error":"#REF!"}},{"$f":"VLOOKUP(G35,#REF!,4,FALSE)","v":{"$error":"#REF!"}}]
[null,null,null,null,null,null,null,{"$error":"#REF!"},null,null,null,null,null,null,null,null,null,{"$f":"VLOOKUP(G36,#REF!,3,FALSE)","v":{"$error":"#REF!"}},{"$f":"VLOOKUP(G36,#REF!,6,FALSE)","v":{"$error":"#REF!"}},{"$f":"VLOOKUP(G36,#REF!,4,FALSE)","v":{"$error":"#REF!"}}]
[null,null,null,null,null,null,null,{"$error":"#REF!"},null,null,null,null,null,null,null,null,null,{"$f":"VLOOKUP(G37,#REF!,3,FALSE)","v":{"$error":"#REF!"}},{"$f":"VLOOKUP(G37,#REF!,6,FALSE)","v":{"$error":"#REF!"}},{"$f":"VLOOKUP(G37,#REF!,4,FALSE)","v":{"$error":"#REF!"}}]
[null,null,null,null,null,null,null,{"$error":"#REF!"},null,null,null,null,null,null,null,null,null,{"$f":"VLOOKUP(G38,#REF!,3,FALSE)","v":{"$error":"#REF!"}},{"$f":"VLOOKUP(G38,#REF!,6,FALSE)","v":{"$error":"#REF!"}},{"$f":"VLOOKUP(G38,#REF!,4,FALSE)","v":{"$error":"#REF!"}}]
[null,null,null,null,null,null,null,{"$error":"#REF!"},null,null,null,null,null,null,null,null,null,{"$f":"VLOOKUP(G39,#REF!,3,FALSE)","v":{"$error":"#REF!"}},{"$f":"VLOOKUP(G39,#REF!,6,FALSE)","v":{"$error":"#REF!"}},{"$f":"VLOOKUP(G39,#REF!,4,FALSE)","v":{"$error":"#REF!"}}]
[null,null,null,null,null,null,null,{"$error":"#REF!"},null,null,null,null,null,null,null,null,null,{"$f":"VLOOKUP(G40,#REF!,3,FALSE)","v":{"$error":"#REF!"}},{"$f":"VLOOKUP(G40,#REF!,6,FALSE)","v":{"$error":"#REF!"}},{"$f":"VLOOKUP(G40,#REF!,4,FALSE)","v":{"$error":"#REF!"}}]
[null,null,null,null,null,null,null,{"$error":"#REF!"},null,null,null,null,null,null,null,null,null,{"$f":"VLOOKUP(G41,#REF!,3,FALSE)","v":{"$error":"#REF!"}},{"$f":"VLOOKUP(G41,#REF!,6,FALSE)","v":{"$error":"#REF!"}},{"$f":"VLOOKUP(G41,#REF!,4,FALSE)","v":{"$error":"#REF!"}}]
[null,null,null,null,null,null,null,{"$error":"#REF!"},null,null,null,null,null,null,null,null,null,{"$f":"VLOOKUP(G42,#REF!,3,FALSE)","v":{"$error":"#REF!"}},{"$f":"VLOOKUP(G42,#REF!,6,FALSE)","v":{"$error":"#REF!"}},{"$f":"VLOOKUP(G42,#REF!,4,FALSE)","v":{"$error":"#REF!"}}]
[null,null,null,null,null,null,null,{"$error":"#REF!"},null,null,null,null,null,null,null,null,null,{"$f":"VLOOKUP(G43,#REF!,3,FALSE)","v":{"$error":"#REF!"}},{"$f":"VLOOKUP(G43,#REF!,6,FALSE)","v":{"$error":"#REF!"}},{"$f":"VLOOKUP(G43,#REF!,4,FALSE)","v":{"$error":"#REF!"}}]
[null,null,null,null,null,null,null,{"$error":"#REF!"},null,null,null,null,null,null,null,null,null,{"$f":"VLOOKUP(G44,#REF!,3,FALSE)","v":{"$error":"#REF!"}},{"$f":"VLOOKUP(G44,#REF!,6,FALSE)","v":{"$error":"#REF!"}},{"$f":"VLOOKUP(G44,#REF!,4,FALSE)","v":{"$error":"#REF!"}}]
[null,null,null,null,null,null,null,{"$error":"#REF!"},null,null,null,null,null,null,null,null,null,{"$f":"VLOOKUP(G45,#REF!,3,FALSE)","v":{"$error":"#REF!"}},{"$f":"VLOOKUP(G45,#REF!,6,FALSE)","v":{"$error":"#REF!"}},{"$f":"VLOOKUP(G45,#REF!,4,FALSE)","v":{"$error":"#REF!"}}]
[null,null,null,null,null,null,null,{"$error":"#REF!"},null,null,null,null,null,null,null,null,null,{"$f":"VLOOKUP(G46,#REF!,3,FALSE)","v":{"$error":"#REF!"}},{"$f":"VLOOKUP(G46,#REF!,6,FALSE)","v":{"$error":"#REF!"}},{"$f":"VLOOKUP(G46,#REF!,4,FALSE)","v":{"$error":"#REF!"}}]
[null,null,null,null,null,null,null,{"$error":"#REF!"},null,null,null,null,null,null,null,null,null,{"$f":"VLOOKUP(G47,#REF!,3,FALSE)","v":{"$error":"#REF!"}},{"$f":"VLOOKUP(G47,#REF!,6,FALSE)","v":{"$error":"#REF!"}},{"$f":"VLOOKUP(G47,#REF!,4,FALSE)","v":{"$error":"#REF!"}}]
[null,null,null,null,null,null,null,{"$error":"#REF!"},null,null,null,null,null,null,null,null,null,{"$f":"VLOOKUP(G48,#REF!,3,FALSE)","v":{"$error":"#REF!"}},{"$f":"VLOOKUP(G48,#REF!,6,FALSE)","v":{"$error":"#REF!"}},{"$f":"VLOOKUP(G48,#REF!,4,FALSE)","v":{"$error":"#REF!"}}]
[null,null,null,null,null,null,null,{"$error":"#REF!"},null,null,null,null,null,null,null,null,null,{"$f":"VLOOKUP(G49,#REF!,3,FALSE)","v":{"$error":"#REF!"}},{"$f":"VLOOKUP(G49,#REF!,6,FALSE)","v":{"$error":"#REF!"}},{"$f":"VLOOKUP(G49,#REF!,4,FALSE)","v":{"$error":"#REF!"}}]
[null,null,null,null,null,null,null,{"$error":"#REF!"},null,null,null,null,null,null,null,null,null,{"$f":"VLOOKUP(G50,#REF!,3,FALSE)","v":{"$error":"#REF!"}},{"$f":"VLOOKUP(G50,#REF!,6,FALSE)","v":{"$error":"#REF!"}},{"$f":"VLOOKUP(G50,#REF!,4,FALSE)","v":{"$error":"#REF!"}}]
[null,null,null,null,null,null,null,{"$error":"#REF!"},null,null,null,null,null,null,null,null,null,{"$f":"VLOOKUP(G51,#REF!,3,FALSE)","v":{"$error":"#REF!"}},{"$f":"VLOOKUP(G51,#REF!,6,FALSE)","v":{"$error":"#REF!"}},{"$f":"VLOOKUP(G51,#REF!,4,FALSE)","v":{"$error":"#REF!"}}]
[null,null,null,null,null,null,null,{"$error":"#REF!"},null,null,null,null,null,null,null,null,null,{"$f":"VLOOKUP(G52,#REF!,3,FALSE)","v":{"$error":"#REF!"}},{"$f":"VLOOKUP(G52,#REF!,6,FALSE)","v":{"$error":"#REF!"}},{"$f":"VLOOKUP(G52,#REF!,4,FALSE)","v":{"$error":"#REF!"}}]
[null,null,null,null,null,null,null,{"$error":"#REF!"},null,null,null,null,null,null,null,null,null,{"$f":"VLOOKUP(G53,#REF!,3,FALSE)","v":{"$error":"#REF!"}},{"$f":"VLOOKUP(G53,#REF!,6,FALSE)","v":{"$error":"#REF!"}},{"$f":"VLOOKUP(G53,#REF!,4,FALSE)","v":{"$error":"#REF!"}}]
[null,null,null,null,null,null,null,{"$error":"#REF!"},null,null,null,null,null,null,null,null,null,{"$f":"VLOOKUP(G54,#REF!,3,FALSE)","v":{"$error":"#REF!"}},{"$f":"VLOOKUP(G54,#REF!,6,FALSE)","v":{"$error":"#REF!"}},{"$f":"VLOOKUP(G54,#REF!,4,FALSE)","v":{"$error":"#REF!"}}]
[null,null,null,null,null,null,null,{"$error":"#REF!"},null,null,null,null,null,null,null,null,null,{"$f":"VLOOKUP(G55,#REF!,3,FALSE)","v":{"$error":"#REF!"}},{"$f":"VLOOKUP(G55,#REF!,6,FALSE)","v":{"$error":"#REF!"}},{"$f":"VLOOKUP(G55,#REF!,4,FALSE)","v":{"$error":"#REF!"}}]
[null,null,null,null,null,null,null,{"$error":"#REF!"},null,null,null,null,null,null,null,null,null,{"$f":"VLOOKUP(G56,#REF!,3,FALSE)","v":{"$error":"#REF!"}},{"$f":"VLOOKUP(G56,#REF!,6,FALSE)","v":{"$error":"#REF!"}},{"$f":"VLOOKUP(G56,#REF!,4,FALSE)","v":{"$error":"#REF!"}}]
[null,null,null,null,null,null,null,{"$error":"#REF!"},null,null,null,null,null,null,null,null,null,{"$f":"VLOOKUP(G57,#REF!,3,FALSE)","v":{"$error":"#REF!"}},{"$f":"VLOOKUP(G57,#REF!,6,FALSE)","v":{"$error":"#REF!"}},{"$f":"VLOOKUP(G57,#REF!,4,FALSE)","v":{"$error":"#REF!"}}]
[null,null,null,null,null,null,null,{"$error":"#REF!"},null,null,null,null,null,null,null,null,null,{"$f":"VLOOKUP(G58,#REF!,3,FALSE)","v":{"$error":"#REF!"}},{"$f":"VLOOKUP(G58,#REF!,6,FALSE)","v":{"$error":"#REF!"}},{"$f":"VLOOKUP(G58,#REF!,4,FALSE)","v":{"$error":"#REF!"}}]
[null,null,null,null,null,null,null,{"$error":"#REF!"},null,null,null,null,null,null,null,null,null,{"$f":"VLOOKUP(G59,#REF!,3,FALSE)","v":{"$error":"#REF!"}},{"$f":"VLOOKUP(G59,#REF!,6,FALSE)","v":{"$error":"#REF!"}},{"$f":"VLOOKUP(G59,#REF!,4,FALSE)","v":{"$error":"#REF!"}}]
[null,null,null,null,null,null,null,{"$error":"#REF!"},null,null,null,null,null,null,null,null,null,{"$f":"VLOOKUP(G60,#REF!,3,FALSE)","v":{"$error":"#REF!"}},{"$f":"VLOOKUP(G60,#REF!,6,FALSE)","v":{"$error":"#REF!"}},{"$f":"VLOOKUP(G60,#REF!,4,FALSE)","v":{"$error":"#REF!"}}]
[null,null,null,null,null,null,null,{"$error":"#REF!"},null,null,null,null,null,null,null,null,null,{"$f":"VLOOKUP(G61,#REF!,3,FALSE)","v":{"$error":"#REF!"}},{"$f":"VLOOKUP(G61,#REF!,6,FALSE)","v":{"$error":"#REF!"}},{"$f":"VLOOKUP(G61,#REF!,4,FALSE)","v":{"$error":"#REF!"}}]
[null,null,null,null,null,null,null,{"$error":"#REF!"},null,null,null,null,null,null,null,null,null,{"$f":"VLOOKUP(G62,#REF!,3,FALSE)","v":{"$error":"#REF!"}},{"$f":"VLOOKUP(G62,#REF!,6,FALSE)","v":{"$error":"#REF!"}},{"$f":"VLOOKUP(G62,#REF!,4,FALSE)","v":{"$error":"#REF!"}}]
[null,null,null,null,null,null,null,{"$error":"#REF!"},null,null,null,null,null,null,null,null,null,{"$f":"VLOOKUP(G63,#REF!,3,FALSE)","v":{"$error":"#REF!"}},{"$f":"VLOOKUP(G63,#REF!,6,FALSE)","v":{"$error":"#REF!"}},{"$f":"VLOOKUP(G63,#REF!,4,FALSE)","v":{"$error":"#REF!"}}]
[null,null,null,null,null,null,null,{"$error":"#REF!"},null,null,null,null,null,null,null,null,null,{"$f":"VLOOKUP(G64,#REF!,3,FALSE)","v":{"$error":"#REF!"}},{"$f":"VLOOKUP(G64,#REF!,6,FALSE)","v":{"$error":"#REF!"}},{"$f":"VLOOKUP(G64,#REF!,4,FALSE)","v":{"$error":"#REF!"}}]
[null,null,null,null,null,null,null,{"$error":"#REF!"},null,null,null,null,null,null,null,null,null,{"$f":"VLOOKUP(G65,#REF!,3,FALSE)","v":{"$error":"#REF!"}},{"$f":"VLOOKUP(G65,#REF!,6,FALSE)","v":{"$error":"#REF!"}},{"$f":"VLOOKUP(G65,#REF!,4,FALSE)","v":{"$error":"#REF!"}}]
[null,null,null,null,null,null,null,{"$error":"#REF!"},null,null,null,null,null,null,null,null,null,{"$f":"VLOOKUP(G66,#REF!,3,FALSE)","v":{"$error":"#REF!"}},{"$f":"VLOOKUP(G66,#REF!,6,FALSE)","v":{"$error":"#REF!"}},{"$f":"VLOOKUP(G66,#REF!,4,FALSE)","v":{"$error":"#REF!"}}]
[null,null,null,null,null,null,null,{"$error":"#REF!"},null,null,null,null,null,null,null,null,null,{"$f":"VLOOKUP(G67,#REF!,3,FALSE)","v":{"$error":"#REF!"}},{"$f":"VLOOKUP(G67,#REF!,6,FALSE)","v":{"$error":"#REF!"}},{"$f":"VLOOKUP(G67,#REF!,4,FALSE)","v":{"$error":"#REF!"}}]
[null,null,null,null,null,null,null,{"$error":"#REF!"},null,null,null,null,null,null,null,null,null,{"$f":"VLOOKUP(G68,#REF!,3,FALSE)","v":{"$error":"#REF!"}},{"$f":"VLOOKUP(G68,#REF!,6,FALSE)","v":{"$error":"#REF!"}},{"$f":"VLOOKUP(G68,#REF!,4,FALSE)","v":{"$error":"#REF!"}}]
[null,null,null,null,null,null,null,{"$error":"#REF!"},null,null,null,null,null,null,null,null,null,{"$f":"VLOOKUP(G69,#REF!,3,FALSE)","v":{"$error":"#REF!"}},{"$f":"VLOOKUP(G69,#REF!,6,FALSE)","v":{"$error":"#REF!"}},{"$f":"VLOOKUP(G69,#REF!,4,FALSE)","v":{"$error":"#REF!"}}]
[null,null,null,null,null,null,null,{"$error":"#REF!"},null,null,null,null,null,null,null,null,null,{"$f":"VLOOKUP(G70,#REF!,3,FALSE)","v":{"$error":"#REF!"}},{"$f":"VLOOKUP(G70,#REF!,6,FALSE)","v":{"$error":"#REF!"}},{"$f":"VLOOKUP(G70,#REF!,4,FALSE)","v":{"$error":"#REF!"}}]
[null,null,null,null,null,null,null,{"$error":"#REF!"},null,null,null,null,null,null,null,null,null,{"$f":"VLOOKUP(G71,#REF!,3,FALSE)","v":{"$error":"#REF!"}},{"$f":"VLOOKUP(G71,#REF!,6,FALSE)","v":{"$error":"#REF!"}},{"$f":"VLOOKUP(G71,#REF!,4,FALSE)","v":{"$error":"#REF!"}}]
[null,null,null,null,null,null,null,{"$error":"#REF!"},null,null,null,null,null,null,null,null,null,{"$f":"VLOOKUP(G72,#REF!,3,FALSE)","v":{"$error":"#REF!"}},{"$f":"VLOOKUP(G72,#REF!,6,FALSE)","v":{"$error":"#REF!"}},{"$f":"VLOOKUP(G72,#REF!,4,FALSE)","v":{"$error":"#REF!"}}]
[null,null,null,null,null,null,null,{"$error":"#REF!"},null,null,null,null,null,null,null,null,null,{"$f":"VLOOKUP(G73,#REF!,3,FALSE)","v":{"$error":"#REF!"}},{"$f":"VLOOKUP(G73,#REF!,6,FALSE)","v":{"$error":"#REF!"}},{"$f":"VLOOKUP(G73,#REF!,4,FALSE)","v":{"$error":"#REF!"}}]
[null,null,null,null,null,null,null,{"$error":"#REF!"},null,null,null,null,null,null,null,null,null,{"$f":"VLOOKUP(G74,#REF!,3,FALSE)","v":{"$error":"#REF!"}},{"$f":"VLOOKUP(G74,#REF!,6,FALSE)","v":{"$error":"#REF!"}},{"$f":"VLOOKUP(G74,#REF!,4,FALSE)","v":{"$error":"#REF!"}}]
[null,null,null,null,null,null,null,{"$error":"#REF!"},null,null,null,null,null,null,null,null,null,{"$f":"VLOOKUP(G75,#REF!,3,FALSE)","v":{"$error":"#REF!"}},{"$f":"VLOOKUP(G75,#REF!,6,FALSE)","v":{"$error":"#REF!"}},{"$f":"VLOOKUP(G75,#REF!,4,FALSE)","v":{"$error":"#REF!"}}]
[null,null,null,null,null,null,null,{"$error":"#REF!"},null,null,null,null,null,null,null,null,null,{"$f":"VLOOKUP(G76,#REF!,3,FALSE)","v":{"$error":"#REF!"}},{"$f":"VLOOKUP(G76,#REF!,6,FALSE)","v":{"$error":"#REF!"}},{"$f":"VLOOKUP(G76,#REF!,4,FALSE)","v":{"$error":"#REF!"}}]
[null,null,null,null,null,null,null,{"$error":"#REF!"},null,null,null,null,null,null,null,null,null,{"$f":"VLOOKUP(G77,#REF!,3,FALSE)","v":{"$error":"#REF!"}},{"$f":"VLOOKUP(G77,#REF!,6,FALSE)","v":{"$error":"#REF!"}},{"$f":"VLOOKUP(G77,#REF!,4,FALSE)","v":{"$error":"#REF!"}}]
[null,null,null,null,null,null,null,{"$error":"#REF!"},null,null,null,null,null,null,null,null,null,{"$f":"VLOOKUP(G78,#REF!,3,FALSE)","v":{"$error":"#REF!"}},{"$f":"VLOOKUP(G78,#REF!,6,FALSE)","v":{"$error":"#REF!"}},{"$f":"VLOOKUP(G78,#REF!,4,FALSE)","v":{"$error":"#REF!"}}]
[null,null,null,null,null,null,null,{"$error":"#REF!"},null,null,null,null,null,null,null,null,null,{"$f":"VLOOKUP(G79,#REF!,3,FALSE)","v":{"$error":"#REF!"}},{"$f":"VLOOKUP(G79,#REF!,6,FALSE)","v":{"$error":"#REF!"}},{"$f":"VLOOKUP(G79,#REF!,4,FALSE)","v":{"$error":"#REF!"}}]
[null,null,null,null,null,null,null,{"$f":"R80","v":{"$error":"#REF!"}},null,null,null,null,null,null,null,null,null,{"$f":"VLOOKUP(G80,#REF!,3,FALSE)","v":{"$error":"#REF!"}},{"$f":"VLOOKUP(G80,#REF!,6,FALSE)","v":{"$error":"#REF!"}},{"$f":"VLOOKUP(G80,#REF!,4,FALSE)","v":{"$error":"#REF!"}}]
{"$rows_left_out":276}
{"sheet":"FACTSHEET Toppers","index":1,"n_rows":53,"n_cols":16,"rows_kept":53,"cut":false,"hidden":false,"merged":[[3,1,4,4],[3,6,4,9],[45,1,45,3]]}
[]
[]
[]
[null,"Aanleverspecificaties Toppers PRINT",null,null,null,null,"Aanleverspecificaties Toppers & kopstelling Servicecentrum",null,null,null,null,null,null,null,null," "]
[]
[null,"1/1 pagina (alleen in overleg inzetbaar)",null,null,null,null,"1/2 pagina"]
[]
[null,"Maximaal 4 titels | per titel – maximaal 40 tekens inclusief spaties",null,null,null,null,"1 titel – maximaal 50 tekens inclusief spaties"]
[null,"Maximaal 5 beelden waarvan 1 sfeerbeeld",null,null,null,null,"Maximaal 2 beelden waarvan 1 sfeerbeeld*"]
[null,"Maximaal 8 artikelnummers",null,null,null,null,"Maximaal 4 artikelnummers"]
[null,"Maximaal 120 woorden: maximaal 8 USP’s en/of commerciële",null,null,null,null,"Maximaal 40 woorden: maximaal 4 USP’s en/of commerciële "]
[null,"tekst – maximaal 1.000 tekens inclusief spaties",null,null,null,null,"tekst – maximaal 300 tekens inclusief spaties"]
[]
[]
[null,"In Toppers worden geen advertenties van leveranciers opgenomen.",null,null,null,null,"*Is een pagina gevuld met 2 acties van een 1/2de pagina, "]
[null,"Sfeerbeelden bevatten geen teksten.",null,null,null,null,"dan plaatsen we maar 1 sfeerbeeld op die pagina. Staat "]
[null,null,null,null,null,null,"een 1/2de pagina naast een 1/1 de pagina, dan krijgt alleen "]
[null,null,null,null,null,null,"de 1/1 de pagina een sfeerbeeld"]
[]
[]
[]
[]
[]
[]
[]
[]
[null,"1/2 pagina",null,null,"1/4 pagina",null,"Narrowcasting"]
[]
[]
[]
[]
[]
[]
[]
[]
[]
[]
[]
[]
[]
[]
[]
[]
[]
[]
[null,"Max. 2 beelden waarvan 1 sfeerbeeld\n4 artikelnummers\nmax. 40 woorden: 4 USP’s of commerciële tekst.",null,null,"1 productbeeld\n2 artikelnummers\nmax. 30 woorden: 3 USP’s of commerciële tekst."]
[]
[]
[]
[]
[]
[]
[null,null,null,null,null,null,"Kopstellingsbord"]